{"text_format":"1","workbook":"xlsx","n_sheets":13,"sheets":["1. Welcome","2. ID-Card","3. Scoping","4. Practices","5. Outcomes","DataOrgInfos","Data","6. RAI_dashboard","7. RAI_Scores","8. Scoring explanations","codes","Scoring","filters"],"not_rendered":{"charts":12,"images":3,"macros":1,"external_links":1,"defined_names":46,"comments":0,"pivot_tables":0},"unopened":[],"bounds":{"document_bytes":16777216,"sheet_cells":100000,"rows_first":2000,"rows_last":500,"rows_between":2000,"halvings":0,"cell_chars":16384,"cell_head_chars":4096},"cells_cut":0,"cells_raw":0,"read":"whole","date_system":"1900"}

{"sheet":"1. Welcome","index":0,"n_rows":35,"n_cols":2,"rows_kept":35,"cut":false,"hidden":false,"merged":[]}
[]
[null,"Responsible Agricultural Investment Tool for Agribusiness"]
[null,"(RAI TOOL for Agribusiness)"]
[null,"The Responsible Agricultural Investment Tool ('RAI Tool\") is a management tool developed, piloted, and refined by IISD, Cerise+SPTF, and partner organisations to help agribusinesses and agricultural value-chain actors align their policies and procedures with best practices of responsible business conduct.  It promotes compliance with international standards such as the CFS-RAI Principles and IFC Performance Standards."]
[null,"Please help us improve the tool as you use it! \nShare your feedback with Cerise+SPTF (support@spi-online.org) and IISD rai@iisd.org"]
[null,"A Tool for Whom?"]
[null,"This version of the tool has been designed for agribusinesses/agricultural value-chain actors [AVCAs] /agricultural SMEs that are involved in the production, processing and/or trading of agricultural and food products, and that in many cases work directly with smallholder farmers and source agricultural products from them."]
[null,"This focus is consistent with that of CSAF, the Council on Smallholder Agricultural Finance, and matches the major part of impact investors' agricultural portfolio. "]
{"$rows_left_out":28}
{"sheet":"2. ID-Card","index":1,"n_rows":72,"n_cols":17,"rows_kept":72,"cut":false,"hidden":false,"merged":[[40,1,40,5],[42,1,42,4],[1,1,1,5],[1,9,1,10]]}
[]
[null,"ORGANISATION ID CARD",null,null,null,null,null,"For users: We welcome suggestions on how the tool could be improved.",null,"Sources of some indicators"]
[]
[null,"Date of the assessment",null,"YY/MM/YYYY"]
["ID-1","Reporting details",null,"Data","Validation or explanation of response, comments and clarifications","Explanation/Note",null,"Suggestions",null,"CSAF Impact","IRIS+",null,null,null,null,null,{"$f":"ADDRESS(ROW(A5),COLUMN(A5))","v":"$A$5"}]
["ID-2","GENERAL INFORMATION",null,null,null,null,null,null,null,null,null,null,null,null,null,null,{"$f":"ADDRESS(ROW(A6),COLUMN(A6))","v":"$A$6"}]
["ID-3","Name",null,null,null,"Full name in order to avoid double-counting, mistaking for other companies, etc.",null,null,null,"CSAF Impact",null,null,null,null,null,null,"$A$7"]
["ID-4","Acronym (if any)",null,null,null,null,null,null,null,null,null,null,null,null,null,null,"$A$8"]
{"$rows_left_out":65}
{"sheet":"3. Scoping","index":2,"n_rows":26,"n_cols":13,"rows_kept":26,"cut":false,"hidden":false,"merged":[[1,1,1,4],[2,1,2,3],[1,8,1,9]]}
[]
[null,"SCOPING QUESTIONS",null,null,null,null,"For users: We welcome suggestions on how the tool could be improved.",null,"Sources of selected indicators"]
[null,"Answers provided to the following questions will automatically adjust the selection of indicators in the Practices form, keeping only the indicators relevant to the profile of the agribusiness. "]
[null,"Reporting details","Data","Validation or explanation of response, comments and clarifications","Explanation/Note",null,"Suggestions",null,"Iris+",null,null,null,"line number"]
[null,"ANIMAL WELFARE",null,null,null,null,null,null,null,null,null,null,{"$f":"ADDRESS(ROW(C5),COLUMN(C5))","v":"$C$5"}]
[null,"Is the agribusiness involved in one of the following sectors: LIVESTOCK, FISHERY, AQUACULTURE?","----",null,"If YES, indicators related to ANIMAL WELFARE will apply.",null,null,null,"PD4686",null,null,null,"$C$6"]
[null,"FOOD SAFETY",null,null,null,null,null,null,null,null,null,null,"$C$7"]
[null,"Is the agribusiness involved in FOOD-related production, processing or trading?","----",null,"If YES, indicators related to FOOD SAFETY will apply.",null,null,null,null,null,null,null,"$C$8"]
{"$rows_left_out":19}
{"sheet":"4. Practices","index":3,"n_rows":311,"n_cols":57,"rows_kept":311,"cut":false,"hidden":false,"merged":[[78,41,85,41],[2,11,3,11],[2,10,3,10],[19,6,22,6],[239,41,240,41],[186,41,190,41],[104,6,108,6],[2,13,2,22],[2,23,2,32],[1,1,1,6],[1,10,1,11],[1,13,1,42],[1,46,1,47],[2,1,2,5],[2,33,2,40],[2,52,2,55],[162,46,164,46],[174,46,177,46],[180,46,184,46],[138,46,144,46],[89,46,91,46],[145,46,149,46]]}
[]
[null,"RESPONSIBLE PRACTICES",null,null,null,null,null,null,"For users: We welcome suggestions on how the tool could be improved.",null,"Sources of selected indicators",null,null,"Mapping against RAI related principles and guideliners (some examples)",null,null,null,null,null,null,null,null,null,null,null,null,null,null,null,null,null,null,null,null,null,null,null,null,null,null,null,null,null,null,null,null,"Key Resources, Notes and Examoles"]
[null,null,null,null,null,null,null,null,null,null,null,null,null,"CFS-RAI principles",null,null,null,null,null,null,null,null,null,"ASEAN-RAI principles",null,null,null,null,null,null,null,null,null,"IFC PS",null,null,null,null,null,null,null,"SAFA TOOL 2.4.1","ESG (USSEPM)",null,"Business Units"]
[null,null,null,null,null,null,null,null,null,null,null,null,null,null,null,null,null,null,null,null,null,null,null,null,null,null,null,null,null,null,null,null,null,null,null,null,null,null,null,null,null,null,null,null,"To be developed in a next phase",null,null,null,null,null,null,null,"Animal welfare","Food safety","Market preferences","Food security"]
[null,"Level","Number","Label","Answers","Validation or explanation of response, comments, and clarifications","Explanation/note",null,"Suggestions",null,"CSAF","Iris+",null,1,2,3,4,5,6,7,8,9,10,1,2,3,4,5,6,7,8,9,10,1,2,3,4,5,6,7,8,null,null,null,null,null,null,"line number",null,null,null,null,"Scope_animal_welfare","Scope_food_safety","Scope_market_preferences","Scope_food_security","Filter"]
[null,"Dimension","1","Strategy and accountability on responsible agriculture",null,null,null,null,null,null,null,null,null,null,null,null,null,null,null,null,null,null,null,null,null,null,null,null,null,null,null,null,null,null,null,null,null,null,null,null,null,null,null,null,null,null,"Resources:\n* \"The Principles for Responsible Investment in Agriculture and Food Systems\" - FAO elearning Academy - https://elearning.fao.org/course/view.php?id=380",{"$f":"ADDRESS(ROW(C6),COLUMN(C6))","v":"$C$6"},null,null,null,null,null,null,null,null,{"$f":"IF(OR(AND(Scope_animal_welfare=\"No\",BA6=\"x\"),AND(Scope_food_safety=\"No\",BB6=\"x\"),AND(Scope_market_preferences=\"No\",BC6=\"x\"),AND(Scope_food_security=\"No\",BD6=\"x\")),\"FALSE\",\"TRUE\")","v":"TRUE"}]
[null,"Standard","1.A","The organisation has a strategy on responsible business conduct and systems in place to implement it.",null,null,"Responsible business conduct is defined by OECD as “making a positive contribution to economic, environmental and social progress with a view to achieving sustainable development, and avoiding and addressing adverse impacts related to an enterprise's direct and indirect operations, products or services”",null,null,null,null,null,null,null,null,null,null,null,null,null,null,null,null,null,null,null,null,null,null,null,null,null,null,"X",null,null,null,null,null,null,null,null,null,null,null,null,null,"$C$7",null,null,null,null,null,null,null,null,"TRUE"]
[null,"EP","1.A.1","The organisation has a documented strategy on responsible business conduct.",null,null,null,null,null,null,null,null,null,null,null,null,null,null,null,null,null,null,null,"X","X",null,null,null,null,null,null,null,null,"X",null,null,null,null,null,null,null,null,"x",null,null,null,"Resources:\n* \"Responsible investment in agriculture and food systems - targeted to the private sector\" - FAO elearning Academy - https://elearning.fao.org/course/view.php?id=626","$C$8",null,null,null,null,null,null,null,null,"TRUE"]
{"$rows_left_out":304}
{"sheet":"5. Outcomes","index":4,"n_rows":65,"n_cols":31,"rows_kept":65,"cut":false,"hidden":false,"merged":[[1,16,1,27],[1,1,1,4],[1,13,1,14],[2,8,3,8],[96,26,103,26],[221,26,225,26],[281,26,282,26],[2,16,2,25],[2,13,3,13],[2,14,3,14]]}
[]
[null,"OUTCOMES - Selected Economic, Social, and Environmental outcomes data",null,null,null,null,"For users: We welcome suggestions on how the tool could be improved.",null,null,null,null,null,null,"Sources of selected indicators",null,null,"Mapping against RAI related principles and guideliners (some examples)"]
[null,null,null,null,null,null,null,null,"Must have",null,null,null,null,null,null,null,"CFS-RAI principles",null,null,null,null,null,null,null,null,null,"SAFA TOOL 2.4.1","SDGs"]
[null,null,null,null,null,null,null,null,null,null,"Filter",null,null,null,null,null,1,2,3,4,5,6,7,8,9,10]
[null,"Reporting details","Data","Validation or explanation of response, comments, and clarifications","Explanation/note",null,"Suggestions",null,null,null,"x",null,null,"CSAF","IRIS+",null,1,2,3,4,5,6,7,8,9,10,null,null,null,null,"line number"]
[null,"As of date (DD/MM/YYYY)",null,null,"Period covered by data. DD/MM/YY. ",null,null,null,null,null,"x",null,null,null,null,null,null,null,null,null,null,null,null,null,null,null,null,null,null,null,{"$f":"ADDRESS(ROW(A6),COLUMN(C6))","v":"$C$6"}]
["cadre","EMPLOYEES AND GOVERNANCE",null,null,null,null,null,null,null,null,{"$f":"#REF!","v":{"$error":"#REF!"}},null,null,null,null,null,null,"X","X","X",null,null,null,null,null,null,null,null,null,null,{"$f":"ADDRESS(ROW(A7),COLUMN(C7))","v":"$C$7"}]
["O-01","Permanent employees (#)",null,null,"Number of people employed by the organisation at the end of the reporting period.  This is the sum of all paid full-time and part-time employees who are employed for a minimum period of 6 months/year. (GIIN IRIS PI8869 - Permanent Employees) ",null,null,null,null,null,{"$f":"#REF!","v":{"$error":"#REF!"}},null,null,"CSAF Impact","OI8869",null,null,"X",null,null,null,null,null,null,null,null,null,"SDG#8",null,null,"$C$8"]
{"$rows_left_out":58}
{"sheet":"DataOrgInfos","index":5,"n_rows":64,"n_cols":7,"rows_kept":64,"cut":false,"hidden":true,"merged":[]}
[null,"Code","Label","Answer","Sheet","Cell","Address"]
[null,"ID-1","As of date (DD/MM/YYYY)",{"$f":"IF(OR(ISBLANK('2. ID-Card'!D4),'2. ID-Card'!D4=\"----\"),FALSE,'2. ID-Card'!D4)","v":"YY/MM/YYYY"},"ID-Card",{"$f":"VLOOKUP(B2,'2. ID-Card'!$A$5:$Q$17,14,0)","v":0},{"$f":"E2&\"!\"&F2","v":"ID-Card!0"}]
[null,"ID-2","GENERAL INFORMATION",{"$f":"IF(OR(ISBLANK('2. ID-Card'!D6),'2. ID-Card'!D6=\"----\"),FALSE,'2. ID-Card'!D6)","v":false},"ID-Card",{"$f":"VLOOKUP(B3,'2. ID-Card'!$A$5:$Q$17,14,0)","v":0},{"$f":"E3&\"!\"&F3","v":"ID-Card!0"}]
[null,"ID-3","Name",{"$f":"IF(OR(ISBLANK('2. ID-Card'!D7),'2. ID-Card'!D7=\"----\"),FALSE,'2. ID-Card'!D7)","v":false},"ID-Card",{"$f":"VLOOKUP(B4,'2. ID-Card'!$A$5:$Q$17,14,0)","v":0},"ID-Card!0"]
[null,"ID-4","Acronym",{"$f":"IF(OR(ISBLANK('2. ID-Card'!D8),'2. ID-Card'!D8=\"----\"),FALSE,'2. ID-Card'!D8)","v":false},"ID-Card",{"$f":"VLOOKUP(B5,'2. ID-Card'!$A$5:$Q$17,14,0)","v":0},"ID-Card!0"]
[null,"ID-7","Primary country of operation",{"$f":"IF(OR(ISBLANK('2. ID-Card'!D11),'2. ID-Card'!D11=\"----\"),FALSE,'2. ID-Card'!D11)","v":false},"ID-Card",{"$f":"VLOOKUP(B6,'2. ID-Card'!$A$5:$Q$17,14,0)","v":0},"ID-Card!0"]
[null,"ID-8","Additional country(s) of operation",{"$f":"IF(OR(ISBLANK('2. ID-Card'!D12),'2. ID-Card'!D12=\"----\"),FALSE,'2. ID-Card'!D12)","v":false},"ID-Card",{"$f":"VLOOKUP(B7,'2. ID-Card'!$A$5:$Q$17,14,0)","v":0},"ID-Card!0"]
[null,"ID-5","Year of creation",{"$f":"IF(OR(ISBLANK('2. ID-Card'!D9),'2. ID-Card'!D9=\"----\"),FALSE,'2. ID-Card'!D9)","v":false},"ID-Card",{"$f":"VLOOKUP(B8,'2. ID-Card'!$A$5:$Q$17,14,0)","v":0},"ID-Card!0"]
{"$rows_left_out":57}
{"sheet":"Data","index":6,"n_rows":306,"n_cols":12,"rows_kept":306,"cut":false,"hidden":true,"merged":[]}
[]
[]
[]
[null,"Code","Level","AnswerB","Label","filter","=cell","check answer","answer","Score"]
[null,"1","Dimension",false,"Strategy and accountability on responsible agriculture",{"$f":"VLOOKUP(B5,'4. Practices'!C:BE,55,0)","v":"TRUE"},{"$f":"VLOOKUP(B5,'4. Practices'!C:E,3,0)","v":0},{"$f":"IF(COUNTIF($L$5:$L$8,G5)=1,TRUE,FALSE)","v":false},{"$f":"IF(AND(D5=TRUE,H5=TRUE,F5=\"TRUE\"),G5,FALSE)","v":false},{"$f":"IFERROR(VLOOKUP(B5,Scoring!Q$4:R$10,2,0)*100,0)","v":0},null,"Yes"]
[null,"1.A","Standard",false,"The organization has a strategy on responsible business conduct and systems in place to implement it.\n[Responsible business conduct is defined by OECD as “making a positive contribution to economic, environmental and social progress with a view to achieving sustainable development, and avoiding and addressing adverse impacts related to an enterprise's direct and indirect operations, products or services”]",{"$f":"VLOOKUP(B6,'4. Practices'!C:BE,55,0)","v":"TRUE"},{"$f":"VLOOKUP(B6,'4. Practices'!C:E,3,0)","v":0},false,{"$f":"IF(AND(D6=TRUE,H6=TRUE,F6=\"TRUE\"),G6,FALSE)","v":false},{"$f":"IFERROR(VLOOKUP(B6,Scoring!Q$4:R$10,2,0)*100,0)","v":0},null,"No"]
[null,"1.A.1","EP",false,"The organization has a documented strategy on responsible business conduct.",{"$f":"VLOOKUP(B7,'4. Practices'!C:BE,55,0)","v":"TRUE"},{"$f":"VLOOKUP(B7,'4. Practices'!C:E,3,0)","v":0},false,false,{"$f":"IFERROR(VLOOKUP(B7,Scoring!Q$4:R$10,2,0)*100,0)","v":0},null,"Partially"]
[null,"1.A.1.1","Indicator",true,"The strategy defines the positive contribution to sustainable development and inclusive growth that the organization seeks to create, such as:\n- contributing to food security and nutrition,\n- contributing to sustainable and inclusive economic development,\n- fostering gender equality and women empowerment,\n- fostering rural youth empowerment,\n- other.",{"$f":"VLOOKUP(B8,'4. Practices'!C:BE,55,0)","v":"TRUE"},{"$f":"VLOOKUP(B8,'4. Practices'!C:E,3,0)","v":"----"},false,false,{"$f":"IFERROR(VLOOKUP(B8,Scoring!Q$4:R$10,2,0)*100,0)","v":0},null,"N/A"]
{"$rows_left_out":299}
{"sheet":"6. RAI_dashboard","index":7,"n_rows":66,"n_cols":21,"rows_kept":66,"cut":false,"hidden":false,"merged":[[15,0,17,0],[3,3,3,6],[49,2,49,8],[5,2,5,3],[13,2,13,7],[8,2,8,8],[9,2,12,8],[26,4,26,7],[27,4,27,7],[37,4,38,4],[39,4,40,4],[37,2,38,3],[39,2,40,3],[26,2,26,3],[27,2,27,3]]}
[null,null,null,null,null,null,null,null,null,null,null,null,null,null,"ANSWER"]
[]
[null,null,null,null,null,null,null,null,null,null,null,null,null,null,"ID-1","As of date:",{"$f":"VLOOKUP(O3,data_org,3,0)","v":"YY/MM/YYYY"}]
["WELCOME PAGE",null,null,"RAI TOOL DASHBOARD",null,null,null,null,null,null,null,null,null,null,"ID-3","Name",{"$f":"VLOOKUP(O4,data_org,3,0)","v":false}]
["ID-CARD",null,{"$f":"IF(Q4=FALSE,P4,Q4)&\" (\"&IF(Q5=FALSE,\"\",Q5)&\")\"","v":"Name ()"},null,null,null,{"$f":"IFERROR(IF(ISBLANK(INDEX(data_org,MATCH(#REF!,label_data_org,0),3)),\"\",UPPER(INDEX(data_org,MATCH(#REF!,label_data_org,0),3))),\"\")","v":""},{"$f":"P3","v":"As of date:"},{"$f":"IF(Q3=FALSE,P3,Q3)","v":"YY/MM/YYYY"},null,null,null,null,null,"ID-4","Acronym",{"$f":"VLOOKUP(O5,data_org,3,0)","v":false}]
["PRACTICES",null,{"$f":"IF(Q6=FALSE,P6,Q6)","v":"Primary country of operation"},null,null,null,null,null,null,null,null,null,null,null,"ID-7","Primary country of operation",{"$f":"VLOOKUP(O6,data_org,3,0)","v":false}]
["OUTCOMES",null,{"$f":"IF(Q13=FALSE,P13,Q13)","v":"Legal status / type of ownership"}]
["STANDARDS OUTPUT",null,"Year of establishment:",{"$f":"IF(Q12=FALSE,P12,Q12)","v":"Year of creation"},null,null,null,{"$f":"IF(I8=\"\",\"\",\"Date of Due Diligence:\")","v":""},"",null,null,null,null,null,"ID-8","Additional country(s) of operation",{"$f":"VLOOKUP(O8,data_org,3,0)","v":false}]
{"$rows_left_out":59}
{"sheet":"7. RAI_Scores","index":8,"n_rows":27,"n_cols":18,"rows_kept":27,"cut":false,"hidden":false,"merged":[[1,1,1,10],[1,11,1,13]]}
[]
["WELCOME PAGE","RAI Scores by Dimensions and Standards",null,null,null,null,null,null,null,null,null,"RAI DASHBOARD"]
[]
[null,null,null,null,null,null,null,null,null,null,null,null,null,null,null,null,null,"1 - Strategy and accountability on responsible agriculture"]
[null,null,null,null,null,null,null,null,null,null,null,null,null,null,null,null,null,"2 - Inclusive and transparent structure"]
[null,null,null,null,null,null,null,null,null,null,null,null,null,null,null,null,null,"3- Safe and responsible agriculture and food systems and operations"]
[null,null,null,null,null,null,null,null,null,null,null,null,null,null,null,null,null,"4 - Environmentally sustainable processes and products"]
[null,null,null,null,null,null,null,null,null,null,null,null,null,null,null,null,null,"5 - Responsible treatment of stakeholders"]
{"$rows_left_out":20}
{"sheet":"8. Scoring explanations","index":9,"n_rows":22,"n_cols":5,"rows_kept":22,"cut":false,"hidden":false,"merged":[[1,1,2,13]]}
[]
[null,"Explanations on the scoping and scoring:"]
[]
[]
[null,"SCOPING"]
[null,"By default, all indicators remain visible."]
[null,"On the \"Scoping\" sheet, filters will be applied for each scoping question to which an answer is provided. Non-relevant indicators will then be hidden on the Practices form."]
[null,"To avoid filling in non-relevant indicators, the best use of the function of the tool is  to FIRST APPLY THE FILTERS, and then fill in the Practices and Outcomes sections."]
{"$rows_left_out":15}
{"sheet":"codes","index":10,"n_rows":298,"n_cols":6,"rows_kept":298,"cut":false,"hidden":true,"merged":[]}
["Dimension",1,"Label_code","nb car","Level","Answer"]
["Standard",3,{"$f":"'4. Practices'!C6:C302","v":"1"},{"$f":"LEN(C2)","v":1},{"$f":"_xlfn.XLOOKUP(D2,$B$1:$B$6,$A$1:$A$6)","v":"Dimension"},false]
["EP",5,"1.A",{"$f":"LEN(C3)","v":3},{"$f":"_xlfn.XLOOKUP(D3,$B$1:$B$6,$A$1:$A$6)","v":"Standard"},false]
["Indicator",7,"1.A.1",5,"EP",false]
["Detail",9,"1.A.1.1",7,"Indicator",true]
["Detail",10,"1.A.1.2",7,"Indicator",false]
[null,null,"1.A.1.2.1",9,"Detail",true]
[null,null,"1.A.1.2.2",9,"Detail",true]
{"$rows_left_out":291}
{"sheet":"Scoring","index":11,"n_rows":301,"n_cols":22,"rows_kept":301,"cut":false,"hidden":true,"merged":[[2,16,2,17],[2,18,2,19],[2,20,2,21]]}
[null,null,"DO NOT ADD COLUMNS"]
["Yes",1,null,"Code","Type","AnswerB","Answer","Score type","Score","EP Group","EP score","Standard group","Standard score","Dimension group","Dimension Score",null,"RECAP"]
["No",0,null,{"$f":"codes!C2:C298","v":"1"},{"$f":"codes!E2:E298","v":"Dimension"},{"$f":"codes!F2:F298","v":false},{"$f":"IF(F3=TRUE,IF(VLOOKUP(D3,Data!$B$5:$I$306,8,0)=FALSE,FALSE,VLOOKUP(D3,Data!$B$5:$I$306,8,0)),FALSE)","v":false},{"$f":"IF(OR(E3=A$7,E3=A$8,E3=A$9),\"Calculated\",\"Answer\")","v":"Calculated"},{"$f":"IF(G3=FALSE,FALSE,VLOOKUP(G3,$A$2:B$5,2,0))","v":false},{"$f":"IF(F3=TRUE,LEFT(D3,5),\"\")","v":""},{"$f":"IFERROR(IF(AND(F3=TRUE,COUNTIF(INDIRECT(\"J\"&ROW(J4)&\":J\"&$B$13),J3)=0),AVERAGEIFS(I:I,J:J,LEFT(D3,5)),\"\"),\"\")","v":""},{"$f":"IF(F3=TRUE,LEFT(D3,3),\"\")","v":""},{"$f":"IFERROR(IF(AND(F3=TRUE,COUNTIF(INDIRECT(\"L\"&ROW(L4)&\":L\"&$B$13),L3)=0),AVERAGEIFS(I:I,L:L,LEFT(D3,3)),\"\"),\"\")","v":""},{"$f":"IF(F3=TRUE,LEFT(D3,1),\"\")","v":""},{"$f":"IFERROR(IF(AND(F3=TRUE,COUNTIF(INDIRECT(\"n\"&ROW(N4)&\":n\"&$B$13),N3)=0),AVERAGEIFS(M:M,N:N,LEFT(D3,1)),\"\"),\"\")","v":""},null,"Dimension",null,"Standard",null,"EP"]
["Partially",0.5,null,"1.A","Standard",false,{"$f":"IF(F4=TRUE,IF(VLOOKUP(D4,Data!$B$5:$I$306,8,0)=FALSE,FALSE,VLOOKUP(D4,Data!$B$5:$I$306,8,0)),FALSE)","v":false},"Calculated",{"$f":"IF(G4=FALSE,FALSE,VLOOKUP(G4,$A$2:B$5,2,0))","v":false},{"$f":"IF(F4=TRUE,LEFT(D4,5),\"\")","v":""},"",{"$f":"IF(F4=TRUE,LEFT(D4,3),\"\")","v":""},"",{"$f":"IF(F4=TRUE,LEFT(D4,1),\"\")","v":""},"",null,"1",{"$f":"_xlfn.MAXIFS(O:O,N:N,Q4)","v":0},{"$f":"_xlfn._xlws.FILTER(D:D,E:E=S3)","v":"1.A"},{"$f":"_xlfn.MAXIFS(M:M,L:L,S4)","v":0},{"$f":"_xlfn._xlws.FILTER(D:D,E:E=U3)","v":"1.A.1"},{"$f":"_xlfn.MAXIFS(K:K,J:J,U4)","v":0}]
["N/A","N/A",null,"1.A.1","EP",false,{"$f":"IF(F5=TRUE,IF(VLOOKUP(D5,Data!$B$5:$I$306,8,0)=FALSE,FALSE,VLOOKUP(D5,Data!$B$5:$I$306,8,0)),FALSE)","v":false},"Calculated",{"$f":"IF(G5=FALSE,FALSE,VLOOKUP(G5,$A$2:B$5,2,0))","v":false},"","","","","","",null,"2",0,"1.B",0,"1.A.2",0]
[null,null,null,"1.A.1.1","Indicator",true,{"$f":"IF(F6=TRUE,IF(VLOOKUP(D6,Data!$B$5:$I$306,8,0)=FALSE,FALSE,VLOOKUP(D6,Data!$B$5:$I$306,8,0)),FALSE)","v":false},"Answer",{"$f":"IF(G6=FALSE,FALSE,VLOOKUP(G6,$A$2:B$5,2,0))","v":false},"1.A.1","","1.A","","1","",null,"3",0,"2.A",0,"1.B.1",0]
["Dimension",{"$f":"COUNTIF(E:E,A7)","v":7},null,"1.A.1.2","Indicator",false,{"$f":"IF(F7=TRUE,IF(VLOOKUP(D7,Data!$B$5:$I$306,8,0)=FALSE,FALSE,VLOOKUP(D7,Data!$B$5:$I$306,8,0)),FALSE)","v":false},"Answer",{"$f":"IF(G7=FALSE,FALSE,VLOOKUP(G7,$A$2:B$5,2,0))","v":false},"","","","","","",null,"4",0,"2.B",0,"1.B.2",0]
["Standard",{"$f":"COUNTIF(E:E,A8)","v":17},null,"1.A.1.2.1","Detail",true,{"$f":"IF(F8=TRUE,IF(VLOOKUP(D8,Data!$B$5:$I$306,8,0)=FALSE,FALSE,VLOOKUP(D8,Data!$B$5:$I$306,8,0)),FALSE)","v":false},"Answer",{"$f":"IF(G8=FALSE,FALSE,VLOOKUP(G8,$A$2:B$5,2,0))","v":false},"1.A.1","","1.A","","1","",null,"5",0,"2.C",0,"2.A.1",0]
{"$rows_left_out":294}
{"sheet":"filters","index":12,"n_rows":4,"n_cols":1,"rows_kept":4,"cut":false,"hidden":true,"merged":[]}
["Scope_animal_welfare"]
["Scope_food_safety"]
["Scope_market_preferences"]
["Scope_food_security"]